Invoking Maven for the goals: [org.apache.maven.plugins:maven-javadoc-plugin:2.7:javadoc] with no properties

M2_HOME=/usr/local/Cellar/maven/3.3.9/libexec
MAVEN_OPTS=  -Xmx512m
JAVA_HOME=/Library/Java/JavaVirtualMachines/jdk1.7.0_65.jdk/Contents/Home/jre
JAVA_OPTS=null

[INFO] Scanning for projects...
[INFO]                                                                         
[INFO] ------------------------------------------------------------------------
[INFO] Building ANTLR 4 Runtime Test Generator 4.5.2
[INFO] ------------------------------------------------------------------------
[INFO] 
[INFO] >>> maven-javadoc-plugin:2.7:javadoc (default-cli) > generate-sources @ antlr4-runtime-testsuite >>>
[INFO] 
[INFO] --- maven-enforcer-plugin:1.2:enforce (enforce-maven) @ antlr4-runtime-testsuite ---
[INFO] 
[INFO] <<< maven-javadoc-plugin:2.7:javadoc (default-cli) < generate-sources @ antlr4-runtime-testsuite <<<
[INFO] 
[INFO] --- maven-javadoc-plugin:2.7:javadoc (default-cli) @ antlr4-runtime-testsuite ---
[INFO] ------------------------------------------------------------------------
[INFO] BUILD FAILURE
[INFO] ------------------------------------------------------------------------
[INFO] Total time: 1.278 s
[INFO] Finished at: 2016-01-29T15:30:48-08:00
[INFO] Final Memory: 16M/491M
[INFO] ------------------------------------------------------------------------
[ERROR] Failed to execute goal org.apache.maven.plugins:maven-javadoc-plugin:2.7:javadoc (default-cli) on project antlr4-runtime-testsuite: An error has occurred in JavaDocs report generation:Unable to find javadoc command: The javadoc executable '/Library/Java/JavaVirtualMachines/jdk1.7.0_65.jdk/Contents/Home/jre/bin/javadoc' doesn't exist or is not a file. Verify the JAVA_HOME environment variable. -> [Help 1]
[ERROR] 
[ERROR] To see the full stack trace of the errors, re-run Maven with the -e switch.
[ERROR] Re-run Maven using the -X switch to enable full debug logging.
[ERROR] 
[ERROR] For more information about the errors and possible solutions, please read the following articles:
[ERROR] [Help 1] http://cwiki.apache.org/confluence/display/MAVEN/MojoExecutionException
