Package com.google.cloud.deploy.v1
Enum Rollout.FailureCause
- All Implemented Interfaces:
com.google.protobuf.Internal.EnumLite,com.google.protobuf.ProtocolMessageEnum,Serializable,Comparable<Rollout.FailureCause>
- Enclosing class:
- Rollout
public static enum Rollout.FailureCause
extends Enum<Rollout.FailureCause>
implements com.google.protobuf.ProtocolMessageEnum
Well-known rollout failures.Protobuf enum
google.cloud.deploy.v1.Rollout.FailureCause-
Enum Constant Summary
Enum ConstantsEnum ConstantDescriptionCloud Build failed to fulfill Cloud Deploy's request.Cloud Build is not available, either because it is not enabled or because Cloud Deploy has insufficient permissions.Deployment did not complete within the allotted time.The deploy operation did not complete successfully; check Cloud Build logs.No reason for failure is specified.A Rollout operation had a feature configured that is not supported.Release is abandoned.Release is in a failed state.No Skaffold verify configuration was found. -
Field Summary
FieldsModifier and TypeFieldDescriptionstatic final intCloud Build failed to fulfill Cloud Deploy's request.static final intCloud Build is not available, either because it is not enabled or because Cloud Deploy has insufficient permissions.static final intDeployment did not complete within the allotted time.static final intThe deploy operation did not complete successfully; check Cloud Build logs.static final intNo reason for failure is specified.static final intA Rollout operation had a feature configured that is not supported.static final intRelease is abandoned.static final intRelease is in a failed state.static final intNo Skaffold verify configuration was found. -
Method Summary
Modifier and TypeMethodDescriptionstatic Rollout.FailureCauseforNumber(int value) static com.google.protobuf.Descriptors.EnumDescriptorfinal com.google.protobuf.Descriptors.EnumDescriptorfinal intfinal com.google.protobuf.Descriptors.EnumValueDescriptorstatic com.google.protobuf.Internal.EnumLiteMap<Rollout.FailureCause>static Rollout.FailureCausevalueOf(int value) Deprecated.static Rollout.FailureCausevalueOf(com.google.protobuf.Descriptors.EnumValueDescriptor desc) Returns the enum constant of this type with the specified name.static Rollout.FailureCauseReturns the enum constant of this type with the specified name.static Rollout.FailureCause[]values()Returns an array containing the constants of this enum type, in the order they are declared.
-
Enum Constant Details
-
FAILURE_CAUSE_UNSPECIFIED
No reason for failure is specified.
FAILURE_CAUSE_UNSPECIFIED = 0; -
CLOUD_BUILD_UNAVAILABLE
Cloud Build is not available, either because it is not enabled or because Cloud Deploy has insufficient permissions. See [required permission](https://cloud.google.com/deploy/docs/cloud-deploy-service-account#required_permissions).
CLOUD_BUILD_UNAVAILABLE = 1; -
EXECUTION_FAILED
The deploy operation did not complete successfully; check Cloud Build logs.
EXECUTION_FAILED = 2; -
DEADLINE_EXCEEDED
Deployment did not complete within the allotted time.
DEADLINE_EXCEEDED = 3; -
RELEASE_FAILED
Release is in a failed state.
RELEASE_FAILED = 4; -
RELEASE_ABANDONED
Release is abandoned.
RELEASE_ABANDONED = 5; -
VERIFICATION_CONFIG_NOT_FOUND
No Skaffold verify configuration was found.
VERIFICATION_CONFIG_NOT_FOUND = 6; -
CLOUD_BUILD_REQUEST_FAILED
Cloud Build failed to fulfill Cloud Deploy's request. See failure_message for additional details.
CLOUD_BUILD_REQUEST_FAILED = 7; -
OPERATION_FEATURE_NOT_SUPPORTED
A Rollout operation had a feature configured that is not supported.
OPERATION_FEATURE_NOT_SUPPORTED = 8; -
UNRECOGNIZED
-
-
Field Details
-
FAILURE_CAUSE_UNSPECIFIED_VALUE
public static final int FAILURE_CAUSE_UNSPECIFIED_VALUENo reason for failure is specified.
FAILURE_CAUSE_UNSPECIFIED = 0;- See Also:
-
CLOUD_BUILD_UNAVAILABLE_VALUE
public static final int CLOUD_BUILD_UNAVAILABLE_VALUECloud Build is not available, either because it is not enabled or because Cloud Deploy has insufficient permissions. See [required permission](https://cloud.google.com/deploy/docs/cloud-deploy-service-account#required_permissions).
CLOUD_BUILD_UNAVAILABLE = 1;- See Also:
-
EXECUTION_FAILED_VALUE
public static final int EXECUTION_FAILED_VALUEThe deploy operation did not complete successfully; check Cloud Build logs.
EXECUTION_FAILED = 2;- See Also:
-
DEADLINE_EXCEEDED_VALUE
public static final int DEADLINE_EXCEEDED_VALUEDeployment did not complete within the allotted time.
DEADLINE_EXCEEDED = 3;- See Also:
-
RELEASE_FAILED_VALUE
public static final int RELEASE_FAILED_VALUERelease is in a failed state.
RELEASE_FAILED = 4;- See Also:
-
RELEASE_ABANDONED_VALUE
public static final int RELEASE_ABANDONED_VALUERelease is abandoned.
RELEASE_ABANDONED = 5;- See Also:
-
VERIFICATION_CONFIG_NOT_FOUND_VALUE
public static final int VERIFICATION_CONFIG_NOT_FOUND_VALUENo Skaffold verify configuration was found.
VERIFICATION_CONFIG_NOT_FOUND = 6;- See Also:
-
CLOUD_BUILD_REQUEST_FAILED_VALUE
public static final int CLOUD_BUILD_REQUEST_FAILED_VALUECloud Build failed to fulfill Cloud Deploy's request. See failure_message for additional details.
CLOUD_BUILD_REQUEST_FAILED = 7;- See Also:
-
OPERATION_FEATURE_NOT_SUPPORTED_VALUE
public static final int OPERATION_FEATURE_NOT_SUPPORTED_VALUEA Rollout operation had a feature configured that is not supported.
OPERATION_FEATURE_NOT_SUPPORTED = 8;- See Also:
-
-
Method Details
-
values
Returns an array containing the constants of this enum type, in the order they are declared.- Returns:
- an array containing the constants of this enum type, in the order they are declared
-
valueOf
Returns the enum constant of this type with the specified name. The string must match exactly an identifier used to declare an enum constant in this type. (Extraneous whitespace characters are not permitted.)- Parameters:
name- the name of the enum constant to be returned.- Returns:
- the enum constant with the specified name
- Throws:
IllegalArgumentException- if this enum type has no constant with the specified nameNullPointerException- if the argument is null
-
getNumber
public final int getNumber()- Specified by:
getNumberin interfacecom.google.protobuf.Internal.EnumLite- Specified by:
getNumberin interfacecom.google.protobuf.ProtocolMessageEnum
-
valueOf
Deprecated.Returns the enum constant of this type with the specified name. The string must match exactly an identifier used to declare an enum constant in this type. (Extraneous whitespace characters are not permitted.)- Parameters:
value- the name of the enum constant to be returned.- Returns:
- the enum constant with the specified name
- Throws:
IllegalArgumentException- if this enum type has no constant with the specified nameNullPointerException- if the argument is null
-
forNumber
- Parameters:
value- The numeric wire value of the corresponding enum entry.- Returns:
- The enum associated with the given numeric wire value.
-
internalGetValueMap
-
getValueDescriptor
public final com.google.protobuf.Descriptors.EnumValueDescriptor getValueDescriptor()- Specified by:
getValueDescriptorin interfacecom.google.protobuf.ProtocolMessageEnum
-
getDescriptorForType
public final com.google.protobuf.Descriptors.EnumDescriptor getDescriptorForType()- Specified by:
getDescriptorForTypein interfacecom.google.protobuf.ProtocolMessageEnum
-
getDescriptor
public static com.google.protobuf.Descriptors.EnumDescriptor getDescriptor() -
valueOf
public static Rollout.FailureCause valueOf(com.google.protobuf.Descriptors.EnumValueDescriptor desc) Returns the enum constant of this type with the specified name. The string must match exactly an identifier used to declare an enum constant in this type. (Extraneous whitespace characters are not permitted.)- Parameters:
desc- the name of the enum constant to be returned.- Returns:
- the enum constant with the specified name
- Throws:
IllegalArgumentException- if this enum type has no constant with the specified nameNullPointerException- if the argument is null
-